Ticket #3041 (closed defect: fixed)

Opened 6 years ago

Last modified 6 years ago

build failure on cygwin : redefinition of 'statvfs_works'

Reported by: matzeri Owned by: andrew_b
Priority: major Milestone: 4.8.10
Component: mc-core Version: 4.8.9
Keywords: Cc:
Blocked By: Blocking:
Branch state: merged Votes for changeset: committed-master

Description

4.8.8 builds fine but 4.8.9 does not

/pub/devel/mc/mc-4.8.9-1/src/mc-4.8.9/src/filemanager/filegui.c:282:1: error: redefinition of 'statvfs_works'
/pub/devel/mc/mc-4.8.9-1/src/mc-4.8.9/src/filemanager/filegui.c:107:1: note: previous definition of 'statvfs_works' was he
re
/pub/devel/mc/mc-4.8.9-1/src/mc-4.8.9/src/filemanager/filegui.c: In function 'statvfs_works':
/pub/devel/mc/mc-4.8.9-1/src/mc-4.8.9/src/filemanager/filegui.c:299:1: error: invalid storage class for function 'filegui_
_check_attrs_on_fs'
/pub/devel/mc/mc-4.8.9-1/src/mc-4.8.9/src/filemanager/filegui.c:298:1: warning: ISO C90 forbids mixed declarations and cod
e [-Wdeclaration-after-statement]
/pub/devel/mc/mc-4.8.9-1/src/mc-4.8.9/src/filemanager/filegui.c:351:1: error: invalid storage class for function 'file_frm
t_time'
/pub/devel/mc/mc-4.8.9-1/src/mc-4.8.9/src/filemanager/filegui.c:363:1: error: invalid storage class for function 'file_eta
_prepare_for_show'
/pub/devel/mc/mc-4.8.9-1/src/mc-4.8.9/src/filemanager/filegui.c:380:1: error: invalid storage class for function 'file_bps
_prepare_for_show'
/pub/devel/mc/mc-4.8.9-1/src/mc-4.8.9/src/filemanager/filegui.c:405:1: error: invalid storage class for function 'overwrit
e_query_dialog'
/pub/devel/mc/mc-4.8.9-1/src/mc-4.8.9/src/filemanager/filegui.c:620:1: error:
invalid storage class for function 'is_wildcarded'
/pub/devel/mc/mc-4.8.9-1/src/mc-4.8.9/src/filemanager/filegui.c:635:1: error: invalid storage class for function 'place_progress_buttons'
/pub/devel/mc/mc-4.8.9-1/src/mc-4.8.9/src/filemanager/filegui.c:653:1: error: invalid storage class for function 'progress_button_callback'
/pub/devel/mc/mc-4.8.9-1/src/mc-4.8.9/src/filemanager/filegui.c:667:1: warning: declaration of 'check_progress_buttons' shadows a global declaration [-Wshadow]

Attachments

config.h.bz2 (6.2 KB) - added by matzeri 6 years ago.
config.h.2.bz2 (6.2 KB) - added by matzeri 6 years ago.
config.log.bz2 (23.5 KB) - added by matzeri 6 years ago.

Change History

Changed 6 years ago by matzeri

Changed 6 years ago by matzeri

Changed 6 years ago by matzeri

comment:1 Changed 6 years ago by andrew_b

  • Status changed from new to accepted
  • Owner set to andrew_b
  • Branch state changed from no branch to on review
  • Milestone changed from Future Releases to 4.8.10

Branch: 3041_fix_cygwin_build
changeset:de129e5cbd191238aaa360345eb4d1fa504fe84b

Please test.

Version 0, edited 6 years ago by andrew_b (next)

comment:2 Changed 6 years ago by angel_il

  • Votes for changeset set to angel_il

comment:3 Changed 6 years ago by slavazanko

  • Votes for changeset changed from angel_il to angel_il slavazanko
  • Branch state changed from on review to approved

comment:4 Changed 6 years ago by andrew_b

  • Status changed from accepted to testing
  • Votes for changeset changed from angel_il slavazanko to committed-master
  • Resolution set to fixed
  • Branch state changed from approved to merged

Merged to master: [909d3e0cc40a37214a6141b012d280fa78b97b30].

git log --pretty=oneline 89bb101..909d3e0

comment:5 Changed 6 years ago by andrew_b

  • Status changed from testing to closed
Note: See TracTickets for help on using tickets.